{"text_format":"1","workbook":"xlsx","n_sheets":5,"sheets":["DCF (2012)","Strompreise","Gaspreise","Riskpremium","Feuil2"],"not_rendered":{"charts":1,"images":0,"macros":1,"external_links":6,"defined_names":88,"comments":1,"pivot_tables":0},"unopened":[],"bounds":{"document_bytes":16777216,"sheet_cells":100000,"rows_first":2000,"rows_last":500,"rows_between":2000,"halvings":0,"cell_chars":16384,"cell_head_chars":4096},"cells_cut":0,"cells_raw":0,"read":"whole","date_system":"1900"}

{"sheet":"DCF (2012)","index":0,"n_rows":107,"n_cols":70,"rows_kept":107,"cut":false,"hidden":false,"merged":[]}
["DCF-Rechnung",{"$f":"[4]Brst!$B$4","v":"Frankreich"},null,null,null,"to be updated with new MPE_NOM"]
["Jahr",null,null,null,null,"2006-12-31","2007-12-31","2008-12-31","2009-12-31","2010-12-31","2011-12-31","2012-12-31","2013-12-31","2014-12-31","2015-12-31","2016-12-31","2017-12-31","2018-12-31","2019-12-31","2020-12-31","2021-12-31","2022-12-31","2023-12-31","2024-12-31","2025-12-31","2026-12-31","2027-12-31","2028-12-31","2029-12-31","2030-12-31","2031-12-31","2032-12-31","2033-12-31","2034-12-31","2035-12-31","2036-12-31","2037-12-31","2038-12-31","2039-12-31","2040-12-31","2041-12-31","2042-12-31","2043-12-31","2044-12-31","2045-12-31","2046-12-31","2047-12-31","2048-12-31","2049-12-31","2050-12-31","2051-12-31","2052-12-31","2053-12-31","2054-12-31","2055-12-31","2056-12-31","2057-12-31","2058-12-31","2059-12-31","2060-12-31","2061-12-31","2062-12-31","2063-12-31","2064-12-31","2065-12-31","2066-12-31","2067-12-31","2068-12-31","2069-12-31","2070-12-31"]
["Nominalzins n. St.",6.9000000000000006E-2,null,null,null,{"$f":"IF(YEAR(F$2)>=YEAR($B$6),(1+$B3)^-(YEARFRAC($B$6-1,F$2,4)),(1+$B3)^(YEARFRAC($B$6-1,F$2,4)))","v":1.2348145719344297},{"$f":"IF(YEAR(G$2)>=YEAR($B$6),(1+$B3)^-(YEARFRAC($B$6-1,G$2,4)),(1+$B3)^(YEARFRAC($B$6-1,G$2,4)))","v":1.1551118540078855},{"$f":"IF(YEAR(H$2)>=YEAR($B$6),(1+$B3)^-(YEARFRAC($B$6-1,H$2,4)),(1+$B3)^(YEARFRAC($B$6-1,H$2,4)))","v":1.0805536520186021},1.0108079064720319,0.94556399108702704,0.88453132936111045,0.82743810043134758,0.77403002846711655,0.72406925020310253,0.67733325556885182,0.63361389669677448,0.59271646089501817,0.55445880345651843,0.51867053644201921,0.48519226982415264,0.45387490161286492,0.42457895380062205,0.39717395116989906,0.37153784019635083,0.34755644545963599,0.32512296114091299,0.30413747534229468,0.28450652510972374,0.26614268017747778,0.24896415358042825,0.23289443739983937,0.21786196202042973,0.20379977738113167,0.19064525479993605,0.17833980804484198,0.16682863240864546,0.15606046062548687,0.14598733454208315,{"$f":"IF(YEAR(AM$2)>=YEAR($B$6),(1+$B3)^-(YEARFRAC($B$6-1,AM$2,4)),(1+$B3)^(YEARFRAC($B$6-1,AM$2,4)))","v":0.13656439152673822},0.12774966466486271,0.11950389585113441,0.11179036094586946,0.10457470621690311,9.782479533854363E-2,9.1510566266177373E-2,8.5603897349090158E-2,8.0078482085210637E-2,7.4909711959972522E-2,7.007456684749537E-2,6.5551512485963859E-2,6.1320404570592957E-2,5.7362399037037368E-2,5.3659868135675762E-2,5.0196321922989479E-2,4.6956334820383042E-2,4.3925476913361135E-2,4.1090249685089925E-2,3.8438025898119677E-2,3.5956993356519806E-2,3.3636102297960539E-2,3.1465016181441097E-2,2.9434065651488397E-2,2.7534205473796449E-2,2.5756974250511173E-2,2.4094456735744792E-2,2.2539248583484366E-2,2.1084423370892773E-2,1.9723501750133553E-2,1.8450422591331672E-2,1.7259515988149357E-2]
["Inflation ab 2030",0.02,null,null,null,null,1,{"$f":"(1+[5]Sonstiges!H$6)*G4","v":1.0215264187866928},{"$f":"(1+[5]Sonstiges!I$6)*H4","v":1.0420743639921721},{"$f":"(1+[5]Sonstiges!J$6)*I4","v":1.0616438356164384},{"$f":"(1+[5]Sonstiges!K$6)*J4","v":1.0802348336594914},{"$f":"(1+[5]Sonstiges!L$6)*K4","v":1.0978473581213308},{"$f":"(1+[5]Sonstiges!M$6)*L4","v":1.114481409001957},{"$f":"(1+[5]Sonstiges!N$6)*M4","v":1.1311154598825832},{"$f":"(1+[5]Sonstiges!O$6)*N4","v":1.1477495107632094},{"$f":"(1+[5]Sonstiges!P$6)*O4","v":1.1663405088062622},{"$f":"(1+[5]Sonstiges!Q$6)*P4","v":1.1868884540117417},{"$f":"(1+[5]Sonstiges!R$6)*Q4","v":1.2084148727984345},{"$f":"(1+[5]Sonstiges!S$6)*R4","v":1.2309197651663404},{"$f":"(1+[5]Sonstiges!T$6)*S4","v":1.2544031311154598},{"$f":"(1+[5]Sonstiges!U$6)*T4","v":1.2788649706457924},{"$f":"(1+[5]Sonstiges!V$6)*U4","v":1.3033268101761248},{"$f":"(1+[5]Sonstiges!W$6)*V4","v":1.3287671232876708},{"$f":"(1+[5]Sonstiges!X$6)*W4","v":1.35518590998043},{"$f":"(1+[5]Sonstiges!Y$6)*X4","v":1.3825831702544027},{"$f":"(1+[5]Sonstiges!Z$6)*Y4","v":1.4109589041095887},{"$f":"(1+[5]Sonstiges!AA$6)*Z4","v":1.4403131115459875},{"$f":"(1+[5]Sonstiges!AB$6)*AA4","v":1.4706457925636003},{"$f":"(1+[5]Sonstiges!AC$6)*AB4","v":1.5029354207436394},{"$f":"(1+[5]Sonstiges!AD$6)*AC4","v":1.534246575342465},{"$f":"(1+[5]Sonstiges!AE$6)*AD4","v":1.5665362035225039},{"$f":"(1+[5]Sonstiges!AF$6)*AE4","v":1.5998043052837563},{"$f":"(1+[5]Sonstiges!AG$6)*AF4","v":1.6330724070450087},{"$f":"(1+[5]Sonstiges!AH$6)*AG4","v":1.6673189823874746},{"$f":"(1+[5]Sonstiges!AI$6)*AH4","v":1.7005870841487267},{"$f":"(1+$B$4)*AI4","v":1.7345988258317013},{"$f":"(1+$B$4)*AJ4","v":1.7692908023483354},1.804676618395302,1.8407701507632082,1.8775855537784722,1.9151372648540417,1.9534400101511225,1.9925088103541448,2.0323589865612277,2.0730061662924522,2.1144662896183011,2.1567556154106673,2.1998907277188806,2.2438885422732584,2.2887663131187237,2.334541639381098,2.3812324721687199,2.4288571216120944,2.4774342640443363,2.5269829493252232,2.5775226083117277,2.6290730604779622,2.6816545216875216,2.7352876121212719,2.7899933643636974,2.8457932316509713,2.9027090962839908,2.9607632782096704,3.0199785437738638,3.0803781146493412,3.141985676942328,3.2048253904811745,3.2689218982907979,3.3343003362566139,3.4009863429817462]
["GuD",null,null,null,null,null,{"$f":"1/G4","v":1},{"$f":"1/H4","v":0.97892720306513403},0.95962441314554003,0.9419354838709677,0.92572463768115931,{"$f":"1/L4","v":0.91087344028520489},0.89727831431079885,0.88408304498269896,0.87127024722932644,0.85738255033557054,0.8425391591096455,0.82753036437246963,0.81240063593004774,0.79719188767550708,0.78194338179035972,0.76726726726726746,0.75257731958762908,0.7379061371841158,0.72328379334748782,0.70873786407767003,0.69429347826086996,0.67997338656021311,0.66536458333333359,0.65178571428571463]
["IBN","2010-03-01"]
["Abschlag für DB nach 15a Betrieb",{"$f":"VLOOKUP($A$5,[4]Sonstiges!$A$16:$B$28,2,FALSE)","v":0.01}]
["Efficiency [%]",null,null,null,{"$f":"56.9%","v":0.56899999999999995},{"$f":"E8","v":0.56899999999999995},0.56899999999999995,0.56899999999999995,0.56899999999999995,0.56899999999999995,0.56899999999999995,0.56899999999999995,0.56899999999999995,0.56899999999999995,0.56899999999999995,0.56899999999999995,0.56899999999999995,0.56899999999999995,0.56899999999999995,0.56899999999999995,0.56899999999999995,0.56899999999999995,0.56899999999999995,0.56899999999999995,0.56899999999999995,0.56899999999999995,0.56899999999999995,0.56899999999999995,0.56899999999999995,0.56899999999999995,{"$f":"AD8","v":0.56899999999999995},{"$f":"AE8","v":0.56899999999999995},{"$f":"AF8","v":0.56899999999999995},{"$f":"AG8","v":0.56899999999999995},{"$f":"AH8","v":0.56899999999999995}]
["Availability",0.93100000000000005]
[null,null,null,null,null,null,null,null,null,null,{"$f":"4200*K33","v":4200},{"$f":"4200*L33","v":4200}]
{"$rows_left_out":98}
{"sheet":"Strompreise","index":1,"n_rows":112,"n_cols":33,"rows_kept":112,"cut":false,"hidden":false,"merged":[]}
["Strompreise"]
["[EUR/MWh]",null,"Base price Poyry",null,null,null,44.568283081054688,51.790744781494141,56.942958831787109,58.590843200683594,59.422615051269531,58.994434356689453,58.985645294189453,59.387447357177734,59.135913848876953,58.368965148925781,58.698963165283203,58.948577880859375,60.497428894042969,62.743068695068359,64.476318359375,70.077583312988281,73.899978637695312,76.445236206054687,77.176765441894531,77.828773498535156,79.221481323242188,79.142959594726562]
[]
["Lastpunkt","Dauer [h]","LowCut","Peak",2007,2008,2009,2010,2011,2012,2013,2014,2015,2016,2017,2018,2019,2020,2021,2022,2023,2024,2025,2026,2027,2028,2029,2030,2031,2032,2033,2034,2035]
[]
[null,null,"Base price FW&Interpolated",null,null,null,null,55.300000000000253,58.629999999999789,60.999999999999815,{"$f":"(M6-J6)/3+J6","v":59.633333333333212},{"$f":"(M6-J6)/3+K6","v":58.266666666666609},56.9]
["Peakprices LTM",null,null,null,64.945514270249632,78.180958215235648,102.16,{"$f":"SUMPRODUCT(H9:H110,$B9:$B110,$D9:$D110)/SUMPRODUCT($B9:$B110,$D9:$D110)","v":76.499999999999346},{"$f":"SUMPRODUCT(I9:I110,$B9:$B110,$D9:$D110)/SUMPRODUCT($B9:$B110,$D9:$D110)","v":82.970881226054487},88.499999999999631,81.768608876117511,75.037237547892715,68.305875518879319,65.163292249182618,68.709982530925927,70.726115012749048,77.990247606085589,83.51705933980206,85.293134085929111,79.034616328224772,88.98483473216794,89.174484168052359,92.281051016989139,98.895558135226679,93.360075439019781,91.719202482135998,97.573349718598323,96.452350126673053,{"$f":"SUMPRODUCT(AC9:AC110,$B9:$B110,$D9:$D110)/SUMPRODUCT($B9:$B110,$D9:$D110)","v":96.574625068722881},97.502297194329529,95.512016278563237,93.58050639393997,93.655001648473828]
["Baseprices LTM",null,null,null,41.525751443929799,59.65691730033398,73.350000000000023,{"$f":"SUMPRODUCT(H9:H110,$B9:$B110)/SUM($B9:$B110)","v":55.299999999999599},{"$f":"SUMPRODUCT(I9:I110,$B9:$B110)/SUM($B9:$B110)","v":58.62999999999964},61.167123287671195,59.743964954337919,{"$f":"SUMPRODUCT(L9:L110,$B9:$B110)/SUM($B9:$B110)","v":58.32085799086758},{"$f":"SUMPRODUCT(M9:M110,$B9:$B110)/SUM($B9:$B110)","v":56.897663360538822},54.495304061209964,{"$f":"SUMPRODUCT(O9:O110,$B9:$B110)/SUM($B9:$B110)","v":57.505806668128841},{"$f":"SUMPRODUCT(P9:P110,$B9:$B110)/SUM($B9:$B110)","v":61.152301441584306},67.151065130513771,{"$f":"SUMPRODUCT(R9:R110,$B9:$B110)/SUM($B9:$B110)","v":69.674091947783779},{"$f":"SUMPRODUCT(S9:S110,$B9:$B110)/SUM($B9:$B110)","v":72.630294953470184},70.698624385786772,{"$f":"SUMPRODUCT(U9:U110,$B9:$B110)/SUM($B9:$B110)","v":74.154773741382328},{"$f":"SUMPRODUCT(V9:V110,$B9:$B110)/SUM($B9:$B110)","v":75.625297721628485},79.03101076773504,{"$f":"SUMPRODUCT(X9:X110,$B9:$B110)/SUM($B9:$B110)","v":83.373916781910395},{"$f":"SUMPRODUCT(Y9:Y110,$B9:$B110)/SUM($B9:$B110)","v":85.075312068750733},86.168282727327664,{"$f":"SUMPRODUCT(AA9:AA110,$B9:$B110)/SUM($B9:$B110)","v":90.485508961060646},{"$f":"SUMPRODUCT(AB9:AB110,$B9:$B110)/SUM($B9:$B110)","v":91.284140915625002},{"$f":"SUMPRODUCT(AC9:AC110,$B9:$B110)/SUM($B9:$B110)","v":93.111184255834203},{"$f":"SUMPRODUCT(AD9:AD110,$B9:$B110)/SUM($B9:$B110)","v":93.556735766255542},{"$f":"SUMPRODUCT(AE9:AE110,$B9:$B110)/SUM($B9:$B110)","v":94.600230778312323},{"$f":"SUMPRODUCT(AF9:AF110,$B9:$B110)/SUM($B9:$B110)","v":95.2482576542765},{"$f":"SUMPRODUCT(AG9:AG110,$B9:$B110)/SUM($B9:$B110)","v":97.241924536003495}]
[1,164,0.86,{"$f":"[4]Strompreise!D4","v":0},{"$f":"[4]Strompreise!G4","v":37.982109897949307},{"$f":"[4]Strompreise!H4","v":57.570073485122705},{"$f":"[4]Strompreise!I4","v":69.921312992428355},48.488645788479602,49.945246996998506,50.321138773864526,51.121000000000002,51.920999999999999,52.720463340999999,78.480635321999998,47.056841407000007,57.482842814000001,58.335457254399998,62.487767184000006,64.2902577304,64.991309881599989,66.336633122599991,68.679416089,67.544318007600012,68.636222631999999,73.891754743000007,139.48269862699999,163.74491724160001,161.979102969,185.59900035460001,186.15525606880001,212.22250296940001,212.66008693960001,220.45513498920002]
[2,82,1,{"$f":"[4]Strompreise!D5","v":0},{"$f":"[4]Strompreise!G5","v":35.841595016479495},{"$f":"[4]Strompreise!H5","v":63.7312733993531},{"$f":"[4]Strompreise!I5","v":78.133941575307247},43.345945284641708,45.000414927396477,45.362265552889063,50.307000000000002,55.252000000000002,60.196866139999997,80.504703559999996,54.202890600000003,66.223803439999998,66.903260959999997,70.944306499999996,73.742522809999997,74.529953050000003,76.151327359999996,77.800723550000001,80.094054799999995,81.950075519999999,85.050227120000002,86.429296800000003,87.506227229999993,96.517134499999997,98.422448500000002,100.13285888,102.50990624000001,103.1356186,105.90672585999999]
{"$rows_left_out":103}
{"sheet":"Gaspreise","index":2,"n_rows":110,"n_cols":33,"rows_kept":110,"cut":false,"hidden":false,"merged":[]}
["Gaspreise",null,1]
["[EUR/GJ]"]
[]
["Lastpunkt",null,null,null,2007,2008,2009,2010,2011,2012,2013,2014,2015,2016,2017,2018,2019,2020,2021,2022,2023,2024,2025,2026,2027,2028,2029,2030,2031,2032,2033,2034,2035]
[null,null,"Base price FW&Interpolated",null,null,null,null,20.55568760610959,23.553355523561645,24.725716828934424,{"$f":"(M5-J5)/3+J5","v":23.390296635424423},{"$f":"(M5-J5)/3+K5","v":22.054876441914423},20.719456248404423]
[null,null,null,null,null,null,null,{"$f":"H8*3.6*0.9","v":19.989961643835613},{"$f":"I8*3.6*0.9","v":22.668854794520545},23.851405479452044,22.808021917808219,21.752358904109581,20.696695890410954,16.718104109589046,19.478194520547952,22.088786301369868,23.294071232876725,23.535567123287667,23.700624657534256,23.615876712328774,23.733567123287671,23.483416438356155,23.79212876712328,26.311093150684925,26.904673972602744,27.525008219178087,30.309016438356153,32.761997260273951,33.574956164383572,34.390997260273998,35.203956164383619,33.881621917808161,34.765717808219186]
[]
["Baseprices",null,null,null,null,null,null,{"$f":"SUMPRODUCT(H9:H110,$B9:$B110)/SUM($B9:$B110)","v":6.1697412480974112},{"$f":"SUMPRODUCT(I9:I110,$B9:$B110)/SUM($B9:$B110)","v":6.996560121765599},7.3615449010654457,7.0395129375951289,6.7136910197869071,6.3878691019786888,5.1599086757990875,6.0117884322678865,6.817526636225268,7.1895281582952846,7.2640639269406373,7.3150076103500785,7.2888508371385106,7.32517503805175,7.2479680365296772,7.343249619482493,8.1207077625570747,8.3039117199391175,8.4953729071537296,9.3546347031963428,10.11172754946727,10.36264079147641,10.614505327245061,10.865418569254203,10.457290715372888,10.7301598173516]
[1,164,null,null,{"$f":"([4]Gaspreise!G4*'DCF (2012)'!$C$20)/0.9","v":7.6348765432098764},{"$f":"([4]Gaspreise!H4*'DCF (2012)'!$C$20)/0.9","v":7.360624683024688},{"$f":"([4]Gaspreise!I4*'DCF (2012)'!$C$20)/$C$1","v":11.222215801668955},6.55,8.0388888888888914,8.4527777777777793,7.8888888888888893,7.3222222222222202,6.7555555555555591,7.4444444444444402,5.4027777777777795,7.15,7.75277777777778,8.1055555555555596,8.0527777777777789,8.0527777777777789,8.1083333333333307,8.0638888888888918,7.8611111111111089,8.2888888888888914,9.0277777777777803,9.0083333333333311,9.2916666666666696,10.258333333333301,10.511111111111099,10.761111111111099,11.0138888888889,10.5444444444444,10.819444444444398]
[2,82,null,null,{"$f":"([4]Gaspreise!G5*'DCF (2012)'!$C$20)/0.9","v":7.6348765432098764},{"$f":"([4]Gaspreise!H5*'DCF (2012)'!$C$20)/0.9","v":7.360624683024688},{"$f":"([4]Gaspreise!I5*'DCF (2012)'!$C$20)/$C$1","v":11.222215801668955},6.55,8.0388888888888914,8.4527777777777793,7.8888888888888893,7.3222222222222202,6.7555555555555591,7.4444444444444402,5.4027777777777795,7.15,7.75277777777778,8.1055555555555596,8.0527777777777789,8.0527777777777789,8.1083333333333307,8.0638888888888918,7.8611111111111089,8.2888888888888914,9.0277777777777803,9.0083333333333311,9.2916666666666696,10.258333333333301,10.511111111111099,10.761111111111099,11.0138888888889,10.5444444444444,10.819444444444398]
{"$rows_left_out":101}
{"sheet":"Riskpremium","index":3,"n_rows":110,"n_cols":33,"rows_kept":110,"cut":false,"hidden":false,"merged":[]}
[]
[]
[]
["Riskpremium","[€/MWh]"]
[]
[]
[]
["Lastpunkt","RegBSSteuer",2005,2006,2007,2008,2009,2010,2011,2012,2013,2014,2015,2016,2017,2018,2019,2020,2021,2022,2023,2024,2025,2026,2027,2028,2029,2030,2031,2032,2033,2034,2035]
[1]
[2]
{"$rows_left_out":101}
{"sheet":"Feuil2","index":4,"n_rows":104,"n_cols":6,"rows_kept":104,"cut":false,"hidden":false,"merged":[]}
[]
[null,"Production cost with gas","Prod cost+Riskpremium","Electricity/Lowcut",null,"Risk premium"]
[1,{"$f":"'DCF (2012)'!$O$29+Gaspreise!M9*3.6/'DCF (2012)'!$O$8","v":59.47328614712729},{"$f":"B3+F3","v":59.47328614712729},{"$f":"Strompreise!M9/Strompreise!C9","v":61.30286435},null,{"$f":"Riskpremium!M9","v":0}]
[2,{"$f":"'DCF (2012)'!$O$29+Gaspreise!M10*3.6/'DCF (2012)'!$O$8","v":59.47328614712729},59.47328614712729,{"$f":"Strompreise!M10/Strompreise!C10","v":60.196866139999997},null,{"$f":"Riskpremium!M10","v":0}]
[3,{"$f":"'DCF (2012)'!$O$29+Gaspreise!M11*3.6/'DCF (2012)'!$O$8","v":59.47328614712729},59.47328614712729,{"$f":"Strompreise!M11/Strompreise!C11","v":179.26750491000001},null,{"$f":"Riskpremium!M11","v":0}]
[4,{"$f":"'DCF (2012)'!$O$29+Gaspreise!M12*3.6/'DCF (2012)'!$O$8","v":59.47328614712729},59.47328614712729,{"$f":"Strompreise!M12/Strompreise!C12","v":209.93325336999999},null,{"$f":"Riskpremium!M12","v":0}]
[5,{"$f":"'DCF (2012)'!$O$29+Gaspreise!M13*3.6/'DCF (2012)'!$O$8","v":59.47328614712729},59.47328614712729,{"$f":"Strompreise!M13/Strompreise!C13","v":154.09903333},null,{"$f":"Riskpremium!M13","v":0}]
[6,{"$f":"'DCF (2012)'!$O$29+Gaspreise!M14*3.6/'DCF (2012)'!$O$8","v":59.47328614712729},59.47328614712729,{"$f":"Strompreise!M14/Strompreise!C14","v":98.351186220000002},null,{"$f":"Riskpremium!M14","v":0}]
[7,{"$f":"'DCF (2012)'!$O$29+Gaspreise!M15*3.6/'DCF (2012)'!$O$8","v":59.47328614712729},59.47328614712729,{"$f":"Strompreise!M15/Strompreise!C15","v":67.608674109999995},null,{"$f":"Riskpremium!M15","v":0}]
[8,{"$f":"'DCF (2012)'!$O$29+Gaspreise!M16*3.6/'DCF (2012)'!$O$8","v":59.47328614712729},59.47328614712729,{"$f":"Strompreise!M16/Strompreise!C16","v":124.66402252},null,{"$f":"Riskpremium!M16","v":0}]
{"$rows_left_out":94}